{"text_format":"1","workbook":"xlsx","n_sheets":7,"sheets":["пр.взв","пр.хода","круги","полуфинал","Ит.пр","СТАРТОВЫЙ","нагр. лист"],"not_rendered":{"charts":0,"images":1,"macros":0,"external_links":1,"defined_names":2,"comments":0,"pivot_tables":0},"unopened":[],"bounds":{"document_bytes":16777216,"sheet_cells":100000,"rows_first":2000,"rows_last":500,"rows_between":2000,"halvings":0,"cell_chars":16384,"cell_head_chars":4096},"cells_cut":0,"cells_raw":0,"read":"whole","date_system":"1900"}

{"sheet":"пр.взв","index":0,"n_rows":29,"n_cols":34,"rows_kept":29,"cut":false,"hidden":false,"merged":[[28,9,29,9],[28,10,29,10],[28,11,29,11],[24,9,25,9],[24,10,25,10],[24,11,25,11],[26,9,27,9],[26,10,27,10],[26,11,27,11],[3,24,3,30],[4,16,4,18],[6,33,7,34],[22,9,23,9],[22,10,23,10],[22,11,23,11],[4,3,5,3],[4,4,5,5],[4,7,5,7],[4,6,5,6],[0,0,0,7],[1,1,1,6],[2,0,2,7],[4,0,5,0],[4,1,5,1],[4,2,5,2]]}
["ПРОТОКОЛ ВЗВЕШИВАНИЯ "]
[null,{"$f":"[1]реквизиты!$A$2","v":"Чемпионат России по самбо среди мужчин, женщин и боевому самбо"}]
[{"$f":"[1]реквизиты!$A$3","v":"1-5 марта 2018г.                                              г.Хабаровск"}]
[null,null,null,"В.к. 72 кг.",null,null,null,null,null,null,null,null,null,null,null,null,null,null,null,null,null,null,null,null,"Мандатка"]
["№ п/п","№ п/ж","Ф.И.О.","Дата рожд., разряд","Округ, субъект, город, ведомство",null,"№ карточки","Тренер"]
[null,null,null,null,null,null,null,null,null,null,null,null,null,null,null,null,{"$f":"N7","v":"ЗМС"},{"$f":"N8","v":"КМС"},{"$f":"N9","v":"МС"},{"$f":"N10","v":"МСМК"},{"$f":"N11","v":""},{"$f":"N12","v":""},{"$f":"N13","v":""},null,"Субъект, город.",{"$f":"Q6","v":"ЗМС"},"КМС","МС","МСМК","","",""]
["1",1,"ИСАЕВА Элина Сергеевна","01.08.1984    КМС","СКФО","Р.Дагестан",null,"Магомедов М.А.",null,1,{"$f":"IFERROR(RIGHT(D7,LEN(D7)-FIND(\"*\",SUBSTITUTE(D7,\" \",\"*\",LEN(D7)-LEN(SUBSTITUTE(D7,\" \",\"\"))))),D7)","v":"КМС"},{"$f":"IFERROR(LEFT(F7,FIND(\",\",F7)-1),F7)","v":"Р.Дагестан"},{"$f":"IFERROR(INDEX(субъект,MATCH(SUM(COUNTIF(M$6:M6,субъект)),COUNTIF(субъект,\"<\"&субъект),0)),\"\")","v":"Владимирская обл."},{"$f":"IFERROR(INDEX(разряд,MATCH(SUM(COUNTIF(N$6:N6,разряд)),COUNTIF(разряд,\"<\"&разряд),0)),\"\")","v":"ЗМС"},1,{"$f":"M7","v":"Владимирская обл."},{"$f":"SUMIFS($J$7:$J$38,$L$7:$L$38,P7,$K$7:$K$38,Q$6)","v":0},{"$f":"SUMIFS($J$7:$J$38,$L$7:$L$38,P7,$K$7:$K$38,R$6)","v":0},{"$f":"SUMIFS($J$7:$J$38,$L$7:$L$38,P7,$K$7:$K$38,S$6)","v":0},{"$f":"SUMIFS($J$7:$J$38,$L$7:$L$38,P7,$K$7:$K$38,T$6)","v":1},{"$f":"SUMIFS($J$7:$J$38,$L$7:$L$38,P7,$K$7:$K$38,U$6)","v":0},{"$f":"SUMIFS($J$7:$J$38,$L$7:$L$38,P7,$K$7:$K$38,V$6)","v":0},{"$f":"SUMIFS($J$7:$J$38,$L$7:$L$38,P7,$K$7:$K$38,W$6)","v":0},null,{"$f":"P7","v":"Владимирская обл."},{"$f":"IF(Q7=0,\" \",Q7)","v":" "},{"$f":"IF(R7=0,\" \",R7)","v":" "},{"$f":"IF(S7=0,\" \",S7)","v":" "},{"$f":"IF(T7=0,\" \",T7)","v":1},{"$f":"IF(U7=0,\" \",U7)","v":" "}," "," ",null,{"$f":"SUM(Z7:AF22)","v":13}]
["2",2,"СУПРУНОВА Юлия Александровна","16.04.1994    МС","М","Москва, \"Шаболовка\"",null,"Сабуров А.Л., Фандюшина И.А.",null,1,{"$f":"IFERROR(RIGHT(D8,LEN(D8)-FIND(\"*\",SUBSTITUTE(D8,\" \",\"*\",LEN(D8)-LEN(SUBSTITUTE(D8,\" \",\"\"))))),D8)","v":"МС"},{"$f":"IFERROR(LEFT(F8,FIND(\",\",F8)-1),F8)","v":"Москва"},{"$f":"IFERROR(INDEX(субъект,MATCH(SUM(COUNTIF(M$6:M7,субъект)),COUNTIF(субъект,\"<\"&субъект),0)),\"\")","v":"Москва"},{"$f":"IFERROR(INDEX(разряд,MATCH(SUM(COUNTIF(N$6:N7,разряд)),COUNTIF(разряд,\"<\"&разряд),0)),\"\")","v":"КМС"},2,"Москва",1,0,2,0,0,0,0,null,{"$f":"P8","v":"Москва"},{"$f":"IF($Y$8=$Y$7,\" \",IF(Q8=0,\" \",Q8))","v":1},{"$f":"IF($Y$8=$Y$7,\" \",IF(R8=0,\" \",R8))","v":" "},{"$f":"IF($Y$8=$Y$7,\" \",IF(S8=0,\" \",S8))","v":2},{"$f":"IF($Y$8=$Y$7,\" \",IF(T8=0,\" \",T8))","v":" "}," "," "," "]
{"$rows_left_out":22}
{"sheet":"пр.хода","index":1,"n_rows":44,"n_cols":27,"rows_kept":44,"cut":false,"hidden":false,"merged":[[31,17,32,17],[11,9,11,11],[22,7,22,13],[26,9,27,11],[30,9,31,11],[32,9,33,11],[14,17,15,17],[19,8,20,12],[37,0,37,2],[34,13,35,15],[34,3,35,3],[24,1,25,1],[26,1,27,1],[30,1,31,1],[32,1,33,1],[24,9,25,11],[31,5,32,7],[28,13,28,15],[2,2,2,17],[3,2,3,17],[6,18,7,18],[10,3,11,3],[6,17,7,17],[6,3,7,3],[8,3,9,3],[4,9,4,11],[4,12,4,14],[10,17,11,17],[16,19,17,19],[14,3,15,3],[16,3,17,3],[12,19,13,19],[16,17,17,17],[16,18,17,18],[14,18,15,18],[13,5,13,6],[12,3,13,3],[12,18,13,18],[12,17,13,17],[5,0,5,1],[6,1,7,1],[6,2,7,2],[6,0,7,0],[14,19,15,19],[8,0,9,0],[8,1,9,1],[8,2,9,2],[6,19,7,19],[7,8,8,12],[8,17,9,17],[8,19,9,19],[8,18,9,18],[12,2,13,2],[10,19,11,19],[10,18,11,18],[20,0,21,0],[20,1,21,1],[20,2,21,2],[16,0,17,0],[16,1,17,1],[16,2,17,2],[18,0,19,0],[18,1,19,1],[18,2,19,2],[18,3,19,3],[20,3,21,3],[18,20,19,20],[20,20,21,20],[18,17,19,17],[20,17,21,17],[20,19,21,19],[18,19,19,19],[20,18,21,18],[18,18,19,18],[14,20,15,20],[16,20,17,20],[0,0,0,20],[1,0,1,20],[14,0,15,0],[14,1,15,1],[14,2,15,2],[10,0,11,0],[10,1,11,1],[10,2,11,2],[6,20,7,20],[8,20,9,20],[10,20,11,20],[12,20,13,20],[12,0,13,0],[12,1,13,1]]}
["ВСЕРОССИЙСКАЯ ФЕДЕРАЦИЯ САМБО"]
["ПРОТОКОЛ ХОДА СОРЕВНОВАНИЙ        "]
[null,null,{"$f":"пр.взв!B2","v":"Чемпионат России по самбо среди мужчин, женщин и боевому самбо"}]
[null,null,{"$f":"пр.взв!A3","v":"1-5 марта 2018г.                                              г.Хабаровск"}]
[null,null,null,null,null,null,null,null,null,{"$f":"пр.взв!D4","v":"В.к. 72 кг."},null,null,{"$f":"Y5&\" \"&Z5","v":"13 участников"},null,null,null,null,null,null,null,null,null,null,null,{"$f":"пр.взв!AH7","v":13},"участников"]
["А",null,null,null,null,null,null,null,null,null,null,null,null,null,null,null,null,null,null,null,"Б"]
[1,{"$f":"IFERROR(VLOOKUP(A7,пр.взв!$B$7:$H$22,2,0),\"\")","v":"ИСАЕВА Элина Сергеевна"},{"$f":"IFERROR(VLOOKUP(A7,пр.взв!$B$7:$H$22,3,0),\"\")","v":"01.08.1984    КМС"},{"$f":"IFERROR(VLOOKUP(A7,пр.взв!$B$7:$H$22,5,0),\"\")","v":"Р.Дагестан"},null,null,null,null,"1 место",null,null,null,null,null,null,null,null,{"$f":"IFERROR(VLOOKUP(U7,пр.взв!$B$7:$H$22,2,0),\"\")","v":"СУПРУНОВА Юлия Александровна"},{"$f":"IFERROR(VLOOKUP(U7,пр.взв!$B$7:$H$22,3,0),\"\")","v":"16.04.1994    МС"},{"$f":"IFERROR(VLOOKUP(U7,пр.взв!$B$7:$H$22,5,0),\"\")","v":"Москва, \"Шаболовка\""},2]
[null,null,null,null,9,null,null,9,{"$f":"IFERROR(VLOOKUP(H8,пр.взв!$B$7:$I$22,2,0),\"\")","v":"АЛЕКСЕЕВА Ирина Вячеславовна"},null,null,null,null,null,null,null,10]
{"$rows_left_out":37}
{"sheet":"круги","index":2,"n_rows":61,"n_cols":20,"rows_kept":61,"cut":false,"hidden":false,"merged":[[51,16,52,16],[51,17,52,17],[51,18,52,18],[51,19,52,19],[53,1,54,1],[53,2,54,2],[53,3,54,3],[53,5,54,5],[53,6,54,6],[53,7,54,7],[53,18,54,18],[53,19,54,19],[53,13,54,13],[53,15,54,15],[53,16,54,16],[53,17,54,17],[51,0,54,0],[51,1,52,1],[51,2,52,2],[51,3,52,3],[51,5,52,5],[51,6,52,6],[51,7,52,7],[51,8,52,8],[51,9,52,9],[53,8,54,8],[53,9,54,9],[47,19,48,19],[49,6,50,6],[49,7,50,7],[49,8,50,8],[49,9,50,9],[49,13,50,13],[49,15,50,15],[49,16,50,16],[49,17,50,17],[49,18,50,18],[49,19,50,19],[45,19,46,19],[47,0,50,0],[47,1,48,1],[47,2,48,2],[47,3,48,3],[47,5,48,5],[47,6,48,6],[49,1,50,1],[49,2,50,2],[49,3,50,3],[49,5,50,5],[47,7,48,7],[47,8,48,8],[47,9,48,9],[47,10,50,10],[47,11,48,11],[47,12,48,12],[49,11,50,11],[49,12,50,12],[47,13,48,13],[47,15,48,15],[47,16,48,16],[47,17,48,17],[47,18,48,18],[40,6,41,6],[40,7,41,7],[40,8,41,8],[40,9,41,9],[40,18,41,18],[45,3,46,3],[45,6,46,6],[45,7,46,7],[45,8,46,8],[45,9,46,9],[45,10,46,10],[45,11,46,11],[45,12,46,12],[45,13,46,13],[45,16,46,16],[45,17,46,17],[45,18,46,18],[38,15,39,15],[38,16,39,16],[38,17,39,17],[38,18,39,18],[38,19,39,19],[40,14,41,14],[38,14,39,14],[43,10,43,19],[40,13,41,13],[40,15,41,15],[40,16,41,16],[40,17,41,17],[36,18,37,18],[36,19,37,19],[38,0,41,0],[38,1,39,1],[38,2,39,2],[38,3,39,3],[38,5,39,5],[38,6,39,6],[40,1,41,1],[40,2,41,2],[40,3,41,3],[40,5,41,5],[38,7,39,7],[38,8,39,8],[40,4,41,4],[38,4,39,4],[38,9,39,9],[38,10,41,10],[38,11,39,11],[38,12,39,12],[40,11,41,11],[40,12,41,12],[40,19,41,19],[38,13,39,13],[36,8,37,8],[36,9,37,9],[36,10,37,10],[36,11,37,11],[36,12,37,12],[36,13,37,13],[36,16,37,16],[36,17,37,17],[36,14,37,15],[32,1,33,1],[32,2,33,2],[32,3,33,3],[32,5,33,5],[32,6,33,6],[32,7,33,7],[32,4,33,4],[32,18,33,18],[32,19,33,19],[32,13,33,13],[32,15,33,15],[32,16,33,16],[32,17,33,17],[32,14,33,14],[32,11,33,11],[32,12,33,12],[32,8,33,8],[32,9,33,9],[30,16,31,16],[26,16,27,16],[26,17,27,17],[26,18,27,18],[26,19,27,19],[28,6,29,6],[28,7,29,7],[28,8,29,8],[28,9,29,9],[28,13,29,13],[28,15,29,15],[28,16,29,16],[28,17,29,17],[28,18,29,18],[28,19,29,19],[30,17,31,17],[30,18,31,18],[30,19,31,19],[30,14,31,14],[30,11,31,11],[30,12,31,12],[26,0,29,0],[26,1,27,1],[26,2,27,2],[26,3,27,3],[26,5,27,5],[26,6,27,6],[28,1,29,1],[28,2,29,2],[28,3,29,3],[28,5,29,5],[28,4,29,4],[26,4,27,4],[24,10,25,10],[24,11,25,11],[24,12,25,12],[24,13,25,13],[24,16,25,16],[24,17,25,17],[24,18,25,18],[24,19,25,19],[24,14,25,15],[24,0,25,0],[24,1,25,1],[24,2,25,2],[24,3,25,3],[24,6,25,6],[24,4,25,5],[24,7,25,7],[24,8,25,8],[24,9,25,9],[18,16,19,16],[18,17,19,17],[18,18,19,18],[18,19,19,19],[18,14,19,14],[20,1,21,1],[20,2,21,2],[20,3,21,3],[20,5,21,5],[20,6,21,6],[20,7,21,7],[20,4,21,4],[20,13,21,13],[20,15,21,15],[20,16,21,16],[20,17,21,17],[20,18,21,18],[20,19,21,19],[20,14,21,14],[18,10,21,10],[18,11,19,11],[18,12,19,12],[20,11,21,11],[20,12,21,12],[20,8,21,8],[20,9,21,9],[18,13,19,13],[18,15,19,15],[18,0,21,0],[18,1,19,1],[18,2,19,2],[18,3,19,3],[18,5,19,5],[18,6,19,6],[18,7,19,7],[18,8,19,8],[18,9,19,9],[18,4,19,4],[14,15,15,15],[14,16,15,16],[14,17,15,17],[14,18,15,18],[14,19,15,19],[14,14,15,14],[16,6,17,6],[16,7,17,7],[16,8,17,8],[16,9,17,9],[16,13,17,13],[16,15,17,15],[16,14,17,14],[16,16,17,16],[16,17,17,17],[16,18,17,18],[16,19,17,19],[14,7,15,7],[14,8,15,8],[14,9,15,9],[14,10,17,10],[14,11,15,11],[14,12,15,12],[16,11,17,11],[16,12,17,12],[14,13,15,13],[14,0,17,0],[14,1,15,1],[14,2,15,2],[14,3,15,3],[14,5,15,5],[14,6,15,6],[16,1,17,1],[16,2,17,2],[16,3,17,3],[16,5,17,5],[16,4,17,4],[14,4,15,4],[10,16,11,16],[10,17,11,17],[10,18,11,18],[10,19,11,19],[10,14,11,14],[12,1,13,1],[12,2,13,2],[12,3,13,3],[12,5,13,5],[12,6,13,6],[12,7,13,7],[12,13,13,13],[12,15,13,15],[12,16,13,16],[12,17,13,17],[12,18,13,18],[12,19,13,19],[12,14,13,14],[10,10,13,10],[10,11,11,11],[10,12,11,12],[12,11,13,11],[12,12,13,12],[12,8,13,8],[12,9,13,9],[10,13,11,13],[10,15,11,15],[10,0,13,0],[10,1,11,1],[10,2,11,2],[10,3,11,3],[10,5,11,5],[10,6,11,6],[10,7,11,7],[10,8,11,8],[10,9,11,9],[12,4,13,4],[10,4,11,4],[6,13,7,13],[6,15,7,15],[6,16,7,16],[6,17,7,17],[6,18,7,18],[6,19,7,19],[6,14,7,14],[8,13,9,13],[8,15,9,15],[8,14,9,14],[8,16,9,16],[8,17,9,17],[8,18,9,18],[8,19,9,19],[6,7,7,7],[8,6,9,6],[8,7,9,7],[6,4,7,4],[6,8,7,8],[6,9,7,9],[6,10,9,10],[6,11,7,11],[6,12,7,12],[8,11,9,11],[8,12,9,12],[8,8,9,8],[8,9,9,9],[6,0,9,0],[6,1,7,1],[6,2,7,2],[6,3,7,3],[6,5,7,5],[6,6,7,6],[8,1,9,1],[8,2,9,2],[8,3,9,3],[8,5,9,5],[8,4,9,4],[4,0,5,0],[4,1,5,1],[4,2,5,2],[4,3,5,3],[4,9,5,9],[4,10,5,10],[4,4,5,5],[4,16,5,16],[4,17,5,17],[4,14,5,15],[0,1,0,9],[0,11,0,19],[1,1,1,9],[1,11,1,19],[4,6,5,6],[4,7,5,7],[4,8,5,8],[4,11,5,11],[4,12,5,12],[4,13,5,13],[4,18,5,18],[4,19,5,19],[56,18,57,18],[56,19,57,19],[58,0,61,0],[58,1,59,1],[58,2,59,2],[58,3,59,3],[58,5,59,5],[58,6,59,6],[58,7,59,7],[58,8,59,8],[56,13,57,13],[56,16,57,16],[56,17,57,17],[56,9,57,9],[56,10,57,10],[56,11,57,11],[56,12,57,12],[56,6,57,6],[56,7,57,7],[56,8,57,8],[56,0,57,0],[56,1,57,1],[60,18,61,18],[60,19,61,19],[60,13,61,13],[60,15,61,15],[60,16,61,16],[60,17,61,17],[60,14,61,14],[58,18,59,18],[58,19,59,19],[60,5,61,5],[60,6,61,6],[60,7,61,7],[60,8,61,8],[60,9,61,9],[58,16,59,16],[58,17,59,17],[58,9,59,9],[58,10,61,10],[60,11,61,11],[60,12,61,12],[36,4,37,5],[45,14,46,15],[45,4,46,5],[26,7,27,7],[26,8,27,8],[26,9,27,9],[26,10,29,10],[26,11,27,11],[26,12,27,12],[28,11,29,11],[28,12,29,12],[26,13,27,13],[26,15,27,15],[28,14,29,14],[26,14,27,14],[30,5,31,5],[30,6,31,6],[30,7,31,7],[30,8,31,8],[30,9,31,9],[30,10,33,10],[30,13,31,13],[30,15,31,15],[36,7,37,7],[60,4,61,4],[58,4,59,4],[53,4,54,4],[51,4,52,4],[49,4,50,4],[30,4,31,4],[43,0,43,9],[45,0,46,0],[45,1,46,1],[45,2,46,2],[60,1,61,1],[60,2,61,2],[60,3,61,3],[56,2,57,2],[56,3,57,3],[30,0,33,0],[30,1,31,1],[30,2,31,2],[30,3,31,3],[36,0,37,0],[36,1,37,1],[36,2,37,2],[36,3,37,3],[36,6,37,6],[47,4,48,4],[56,14,57,15],[56,4,57,5],[58,14,59,14],[53,14,54,14],[51,14,52,14],[49,14,50,14],[47,14,48,14],[58,13,59,13],[58,15,59,15],[58,11,59,11],[58,12,59,12],[51,10,54,10],[51,11,52,11],[51,12,52,12],[53,11,54,11],[53,12,54,12],[51,13,52,13],[51,15,52,15]]}
[null,"ВСТРЕЧИ ПО КРУГАМ",null,null,null,null,null,null,null,null,null,"ВСТРЕЧИ ПО КРУГАМ"]
[null,{"$f":"пр.взв!D4","v":"В.к. 72 кг."},null,null,null,null,null,null,null,null,null,{"$f":"B2","v":"В.к. 72 кг."}]
[null,null,"КОВЕР",null,null,null,null,null,null,null,null,null,"КОВЕР"]
[null,"A"," (Круг)","1/8",null,null,null,null,null,null,null,"Б"," (Круг)","1/8"]
["№ встр","№ п/ж","Ф.И.О.","Д. р., разряд","Вед., регион",null,"Оценки","Очки","Рез-т","Время","№ встр","№ п/ж","Ф.И.О.","Д. р., разряд","Вед., регион",null,"Оценки","Очки","Рез-т","Время"]
[null,"№ j",null,null,null,null,null,null,null,"tame",null,"№ j",null,null,null,null,null,null,null,"tame"]
[1,1,{"$f":"VLOOKUP(B7,пр.взв!B$7:E$22,2,FALSE)","v":"ИСАЕВА Элина Сергеевна"},{"$f":"VLOOKUP(B7,пр.взв!B$7:E$22,3,FALSE)","v":"01.08.1984    КМС"},{"$f":"VLOOKUP(B7,пр.взв!B$7:E$22,4,FALSE)","v":"СКФО"},{"$f":"VLOOKUP(B7,пр.взв!B$7:F$22,5,FALSE)","v":"Р.Дагестан"},null,null,null,null,5,2,{"$f":"VLOOKUP(L7,пр.взв!B$7:F$22,2,FALSE)","v":"СУПРУНОВА Юлия Александровна"},{"$f":"VLOOKUP(L7,пр.взв!B$7:F$22,3,FALSE)","v":"16.04.1994    МС"},{"$f":"VLOOKUP(L7,пр.взв!B$7:F$22,4,FALSE)","v":"М"},{"$f":"VLOOKUP(L7,пр.взв!B$7:F$22,5,FALSE)","v":"Москва, \"Шаболовка\""}]
[]
{"$rows_left_out":54}
{"sheet":"полуфинал","index":3,"n_rows":44,"n_cols":9,"rows_kept":44,"cut":false,"hidden":false,"merged":[[4,4,5,5],[4,0,5,0],[4,1,5,1],[4,2,5,2],[4,3,5,3],[6,4,7,4],[6,5,7,5],[6,6,7,6],[6,7,7,7],[6,0,7,0],[6,1,7,1],[6,2,7,2],[6,3,7,3],[8,4,9,4],[8,5,9,5],[8,6,9,6],[8,7,9,7],[8,0,9,0],[8,1,9,1],[8,2,9,2],[8,3,9,3],[18,0,19,0],[18,1,19,1],[18,2,19,2],[18,3,19,3],[16,6,17,6],[16,4,17,5],[16,0,17,0],[16,1,17,1],[16,2,17,2],[16,3,17,3],[29,2,30,2],[29,3,30,3],[20,0,21,0],[20,1,21,1],[20,2,21,2],[20,3,21,3],[0,0,0,8],[33,4,34,4],[33,5,34,5],[33,6,34,6],[33,7,34,7],[33,0,34,0],[33,1,34,1],[33,2,34,2],[33,3,34,3],[31,4,32,4],[31,0,32,0],[31,1,32,1],[31,2,32,2],[31,3,32,3],[29,0,30,0],[29,1,30,1],[4,8,5,8],[6,8,7,8],[8,8,9,8],[29,6,30,6],[29,7,30,7],[16,7,17,7],[4,6,5,6],[4,7,5,7],[20,6,21,6],[20,7,21,7],[18,6,19,6],[18,7,19,7],[33,8,34,8],[16,8,17,8],[18,8,19,8],[20,8,21,8],[29,4,30,5],[29,8,30,8],[31,5,32,5],[31,6,32,6],[31,7,32,7],[31,8,32,8],[20,4,21,4],[20,5,21,5],[18,4,19,4],[18,5,19,5]]}
[{"$f":"пр.взв!B2","v":"Чемпионат России по самбо среди мужчин, женщин и боевому самбо"}]
[null,null,null,null,{"$f":"HYPERLINK(пр.взв!D4)","v":"В.к. 72 кг."}]
[null,null,"ЗА 3 МЕСТО"]
[null,null,"ВСТРЕЧА 1"]
["Цвет","№ п/ж","Ф.И.О.","Д. р., разряд","Вед., регион",null,"Оценки","Рез-т","Время"]
[]
[null,{"$f":"пр.хода!D29","v":7},{"$f":"VLOOKUP(B7,пр.взв!B7:D22,2,FALSE)","v":"БИКБОВА Диана Маратовна"},{"$f":"VLOOKUP(B7,пр.взв!B7:F38,3,FALSE)","v":"25.09.1993    КМС"},{"$f":"VLOOKUP(B7,пр.взв!B7:F38,4,FALSE)","v":"ПФО"},{"$f":"VLOOKUP(B7,пр.взв!B7:G28,5,FALSE)","v":"р.Татарстан, Казань"}]
[]
{"$rows_left_out":37}
{"sheet":"Ит.пр","index":4,"n_rows":28,"n_cols":41,"rows_kept":28,"cut":false,"hidden":false,"merged":[[1,1,1,2],[1,3,1,7],[0,0,0,7],[3,7,4,7],[3,6,4,6],[3,4,4,5],[2,1,2,5],[2,6,2,7],[3,0,4,0],[3,1,4,1],[3,2,4,2],[3,3,4,3],[7,9,8,9],[7,10,8,10],[9,9,10,9],[9,10,10,10],[5,9,6,9],[5,10,6,10],[11,9,12,9],[11,10,12,10],[13,9,14,9],[13,10,14,10],[15,9,16,9],[15,10,16,10],[3,13,3,16],[3,18,4,18],[3,19,4,19],[3,20,3,23],[3,9,4,9],[3,10,4,10],[3,11,4,11],[3,12,4,12],[3,37,3,40],[1,19,1,23],[3,28,4,28],[3,29,4,29],[3,30,3,33],[3,35,4,35],[3,36,4,36]]}
["ВСЕРОССИЙСКАЯ ФЕДЕРАЦИЯ САМБО",null,null,null,null,null,null,null,null,null,null,null,null,null,null,null,null,null,null,{"$f":"SUMIF(T6:T11,V1,$K$14:$K$17)","v":0},null,{"$f":"J12","v":"Москва"}]
[null,"ИТОГОВЫЙ ПРОТОКОЛ  ЖЕНЩИНЫ                                                   ",null,{"$f":"пр.взв!B2","v":"Чемпионат России по самбо среди мужчин, женщин и боевому самбо"},null,null,null,null,null,null,null,null,null,null,null,null,null,null,null,{"$f":"SUMIF(J14:J16,V1,$K$14:$K$17)","v":1}]
[null,{"$f":"пр.взв!A3","v":"1-5 марта 2018г.                                              г.Хабаровск"},null,null,null,null,{"$f":"пр.взв!D4","v":"В.к. 72 кг."}]
[" место","№ п/ж","Ф.И.О.","Дата рожд., разряд","Округ, субъект, город, ведомство",null,"№ карточки","Тренер",null,{"$f":"IFERROR(LEFT(F6,FIND(\",\",F6)-1),F6)","v":"Челябинская обл."},1,"№пп","Субъект",null,null,null,null,null,"№пп","Субъект",null,null,null,null,null,null,null,null,"№пп","Субъект",null,null,null,null,null,"№пп","Субъект"]
[null,null,null,null,null,null,null,null,null,null,null,null,null,1,2,3,5,null,null,null,1,2,3,5,null,1,null,2,null,null,1,2,3,5,null,null,null,1,2,3,5]
[1,{"$f":"пр.хода!H8","v":9},{"$f":"VLOOKUP(B6,пр.взв!B7:H22,2,FALSE)","v":"АЛЕКСЕЕВА Ирина Вячеславовна"},{"$f":"VLOOKUP(B6,пр.взв!B7:H77,3,FALSE)","v":"27.06.1990    МС"},{"$f":"VLOOKUP(B6,пр.взв!B7:H22,4,FALSE)","v":"УФО"},{"$f":"VLOOKUP(B6,пр.взв!B7:H22,5,FALSE)","v":"Челябинская обл., Челябинск"},{"$f":"VLOOKUP(B6,пр.взв!B7:H22,6,FALSE)","v":0},{"$f":"VLOOKUP(B6,пр.взв!B7:H79,7,FALSE)","v":"Мисбахов В.Н., Котова Ю.А."},null,"СМИТ",1,1,"Алтайский",{"$f":"SUMIF($J$4:$J$7,J4,$K$4:$K$7)","v":1},{"$f":"SUMIF($I$8:$J$9,\"алт\",$K$6:$K$9)","v":0},{"$f":"SUMIF($J$10:$J$13,\"Алт\",$K$10:$K$13)","v":0},{"$f":"SUMIF($J$14:$J$17,\"Алт\",$K$14:$K$17)","v":0},null,1,{"$f":"J4","v":"Челябинская обл."},{"$f":"SUMIF($J$4:$J$7,T6,$K$4:$K$7)","v":1},{"$f":"SUMIF($I$8:$J$9,T6,$K$6:$K$9)","v":0},{"$f":"SUMIF($J$10:$J$13,T6,$K$10:$K$13)","v":0},{"$f":"SUMIF($J$14:$J$17,T6,$K$14:$K$17)","v":0},null,{"$f":"T6","v":"Челябинская обл."},null,{"$f":"Z6","v":"Челябинская обл."},1,{"$f":"AB6","v":"Челябинская обл."},{"$f":"SUMIF($J$4:$J$7,AD6,$K$4:$K$7)","v":1},{"$f":"SUMIF($I$8:$J$9,AD6,$K$6:$K$9)","v":0},{"$f":"SUMIF($J$10:$J$13,AD6,$K$10:$K$13)","v":0},{"$f":"SUMIF($J$14:$J$17,AD6,$K$14:$K$17)","v":0},null,1,{"$f":"IF(AD6=0,\" \",AD6)","v":"Челябинская обл."},1," "," "," "]
[2,{"$f":"пр.хода!H20","v":10},{"$f":"VLOOKUP(B7,пр.взв!B1:H22,2,FALSE)","v":"ХОМЯЧКОВА Анастасия Михайловна"},{"$f":"VLOOKUP(B7,пр.взв!B1:H79,3,FALSE)","v":"16.09.1997    МСМК"},{"$f":"VLOOKUP(B7,пр.взв!B1:H22,4,FALSE)","v":"ЦФО"},{"$f":"VLOOKUP(B7,пр.взв!B1:H22,5,FALSE)","v":"Владимирская обл., Юрьев-Польский"},{"$f":"VLOOKUP(B7,пр.взв!B1:H22,6,FALSE)","v":0},{"$f":"VLOOKUP(B7,пр.взв!B1:H81,7,FALSE)","v":"Сенюков Ю.А., Гадалов А.В."},null,null,null,2,"Забайкальский",{"$f":"SUMIF($J$4:$J$7,\"заб\",$K$4:$K$7)","v":0},{"$f":"SUMIF($I$8:$J$9,\"заб\",$K$6:$K$9)","v":0},{"$f":"SUMIF($J$10:$J$13,\"заб\",$K$10:$K$13)","v":0},{"$f":"SUMIF($J$14:$J$17,\"заб\",$K$14:$K$17)","v":0},null,2,{"$f":"IF(J8=J4,\" \",J8)","v":"Владимирская обл."},0,1,0,{"$f":"SUMIF($J$14:$J$17,T7,$K$14:$K$17)","v":0},null,{"$f":"IF(OR(T7=\" \"),T8,T7)","v":"Владимирская обл."},{"$f":"IF(U7=U6,\" \",U7)","v":0},{"$f":"IF(OR(Z7=\" \"),Z8,Z7)","v":"Владимирская обл."},2,{"$f":"IF(OR(AB7=\" \"),AB8,AB7)","v":"Владимирская обл."},0,1,0,0,null,2,"Владимирская обл."," ",1," "," "]
[3,{"$f":"пр.хода!E32","v":8},{"$f":"VLOOKUP(B8,пр.взв!B1:H22,2,FALSE)","v":"ЗЕНЧЕНКО Татьяна Николаевна"},{"$f":"VLOOKUP(B8,пр.взв!B1:H81,3,FALSE)","v":"26.02.1978    ЗМС"},{"$f":"VLOOKUP(B8,пр.взв!B1:H22,4,FALSE)","v":"ДВФО"},{"$f":"VLOOKUP(B8,пр.взв!B1:H22,5,FALSE)","v":"Приморский край, Владивосток"},{"$f":"VLOOKUP(B8,пр.взв!B1:H22,6,FALSE)","v":0},{"$f":"VLOOKUP(B8,пр.взв!B1:H83,7,FALSE)","v":"Леонтьев Ю.А., Фалеева О.А."},null,{"$f":"IFERROR(LEFT(F7,FIND(\",\",F7)-1),F7)","v":"Владимирская обл."},1,3,"Иркутская",{"$f":"SUMIF($J$4:$J$7,\"ирк\",$K$4:$K$7)","v":0},{"$f":"SUMIF($I$8:$J$9,\"ирк\",$K$6:$K$9)","v":0},{"$f":"SUMIF($J$10:$J$13,\"ирк\",$K$10:$K$13)","v":0},{"$f":"SUMIF($J$14:$J$17,\"ирк\",$K$14:$K$17)","v":0},null,3,{"$f":"IF(OR(J10=J4,J10=J8),\" \",J10)","v":"Приморский край"},0,0,1,{"$f":"SUMIF($J$14:$J$17,T8,$K$14:$K$17)","v":0},null,{"$f":"IF(OR(T8=\" \",T7=\" \"),T9,T8)","v":"Приморский край"},null,{"$f":"IF(OR(Z8=\" \",Z7=\" \"),Z9,Z8)","v":"Приморский край"},3,{"$f":"IF(OR(AB8=\" \",AB7=\" \"),AB9,AB8)","v":"Приморский край"},0,0,1,0,null,3,"Приморский край"," "," ",1," "]
{"$rows_left_out":21}
{"sheet":"СТАРТОВЫЙ","index":5,"n_rows":48,"n_cols":6,"rows_kept":48,"cut":false,"hidden":false,"merged":[[6,0,7,0],[6,1,7,1],[6,2,7,2],[6,3,7,3],[3,0,3,1],[0,0,0,10],[1,0,1,10],[4,0,5,0],[4,1,5,1],[4,2,5,2],[4,3,5,3],[8,2,9,2],[8,3,9,3],[14,0,15,0],[14,1,15,1],[14,2,15,2],[14,3,15,3],[10,1,11,1],[10,2,11,2],[10,3,11,3],[8,0,9,0],[8,1,9,1],[11,5,11,6],[12,0,13,0],[12,1,13,1],[12,2,13,2],[12,3,13,3],[10,0,11,0],[18,3,19,3],[16,0,17,0],[16,1,17,1],[16,2,17,2],[16,3,17,3],[18,2,19,2],[29,0,30,0],[31,0,32,0],[33,0,34,0],[33,2,34,2],[18,0,19,0],[18,1,19,1],[33,1,34,1],[21,1,22,1],[27,0,28,0],[21,0,22,0],[23,0,24,0],[25,0,26,0],[21,2,22,2],[21,3,22,3],[23,1,24,1],[23,2,24,2],[23,3,24,3],[25,1,26,1],[25,2,26,2],[25,3,26,3],[28,5,28,6],[31,1,32,1],[31,2,32,2],[31,3,32,3],[27,1,28,1],[27,2,28,2],[29,1,30,1],[29,2,30,2],[29,3,30,3],[27,3,28,3],[33,3,34,3],[35,0,36,0],[38,3,39,3],[47,3,48,3],[35,1,36,1],[35,2,36,2],[35,3,36,3]]}
[{"$f":"пр.взв!B2","v":"Чемпионат России по самбо среди мужчин, женщин и боевому самбо"}]
[{"$f":"пр.взв!A3","v":"1-5 марта 2018г.                                              г.Хабаровск"}]
[null,null,null,null,null,{"$f":"HYPERLINK(пр.взв!D4)","v":"В.к. 72 кг."}]
["А"]
[1,{"$f":"VLOOKUP(A5,пр.взв!B5:C22,2,FALSE)","v":"ИСАЕВА Элина Сергеевна"},{"$f":"VLOOKUP(A5,пр.взв!B5:F22,3,FALSE)","v":"01.08.1984    КМС"},{"$f":"VLOOKUP(A5,пр.взв!B5:F22,4,FALSE)","v":"СКФО"}]
[]
[9,{"$f":"VLOOKUP(A7,пр.взв!B7:C22,2,FALSE)","v":"АЛЕКСЕЕВА Ирина Вячеславовна"},{"$f":"VLOOKUP(A7,пр.взв!B5:F22,3,FALSE)","v":"27.06.1990    МС"},{"$f":"VLOOKUP(A7,пр.взв!B1:G22,5,FALSE)","v":"Челябинская обл., Челябинск"}]
[]
{"$rows_left_out":41}
{"sheet":"нагр. лист","index":6,"n_rows":36,"n_cols":10,"rows_kept":36,"cut":false,"hidden":false,"merged":[[0,0,0,7],[1,0,1,7],[2,0,2,7],[3,3,3,5],[5,0,8,0],[5,7,6,7],[7,1,8,2],[7,3,8,7],[5,1,6,6],[27,0,28,7],[20,0,23,0],[20,1,21,6],[20,7,21,7],[10,0,13,0],[15,0,18,0],[10,7,11,7],[15,1,16,6],[22,1,23,2],[22,3,23,7],[12,1,13,2],[12,3,13,7],[17,1,18,2],[17,3,18,7],[15,7,16,7],[10,1,11,6]]}
[{"$f":"пр.взв!B2","v":"Чемпионат России по самбо среди мужчин, женщин и боевому самбо"}]
[{"$f":"пр.взв!A3","v":"1-5 марта 2018г.                                              г.Хабаровск"}]
["НАГРАДНОЙ ЛИСТ"]
[null,null,null,{"$f":"HYPERLINK(пр.взв!D4)","v":"В.к. 72 кг."}]
[]
["I м",{"$f":"VLOOKUP(J6,пр.взв!B7:G22,2,FALSE)","v":"АЛЕКСЕЕВА Ирина Вячеславовна"},null,null,null,null,null,{"$f":"VLOOKUP(J6,пр.взв!B7:G22,3,FALSE)","v":"27.06.1990    МС"},null,{"$f":"пр.хода!H8","v":9}]
[]
[null,{"$f":"VLOOKUP(J6,пр.взв!B7:G22,4,FALSE)","v":"УФО"},null,{"$f":"VLOOKUP(J6,пр.взв!B7:G22,5,FALSE)","v":"Челябинская обл., Челябинск"}]
{"$rows_left_out":28}